{"text_format":"1","workbook":"xlsx","n_sheets":6,"sheets":["Data","SalaryParticulars","Ascessment form","house rent reciept","Form 16(page1)","Form 16(page2)"],"not_rendered":{"charts":0,"images":0,"macros":1,"external_links":0,"defined_names":5,"comments":2,"pivot_tables":0},"unopened":[],"bounds":{"document_bytes":16777216,"sheet_cells":100000,"rows_first":2000,"rows_last":500,"rows_between":2000,"halvings":0,"cell_chars":16384,"cell_head_chars":4096},"cells_cut":0,"cells_raw":0,"read":"whole","date_system":"1900"}

{"sheet":"Data","index":0,"n_rows":288,"n_cols":46,"rows_kept":288,"cut":false,"hidden":false,"merged":[[103,2,103,4],[94,2,94,3],[95,2,95,3],[98,2,98,3],[109,2,109,3],[101,2,101,3],[102,2,102,3],[99,2,99,3],[100,2,100,3],[6,29,6,32],[7,29,7,32],[8,29,8,32],[9,29,9,32],[10,29,10,32],[43,2,43,4],[72,2,72,3],[11,29,11,32],[12,29,12,32],[13,29,13,32],[14,29,14,32],[22,2,22,4],[11,2,11,3],[65,2,65,3],[50,2,50,3],[48,2,48,3],[49,2,49,3],[67,2,67,3],[64,2,64,4],[62,2,62,4],[83,2,83,3],[84,2,84,3],[85,2,85,3],[82,2,82,3],[76,2,76,4],[81,2,81,4],[75,2,75,3],[15,2,15,4],[29,2,29,3],[46,2,46,4],[71,2,71,3],[63,2,63,4],[47,2,47,3],[51,2,51,4],[36,2,36,4],[68,2,68,3],[66,2,66,3],[70,2,70,3],[26,2,26,3],[73,2,73,3],[69,2,69,3],[74,2,74,3],[204,33,204,34],[111,2,111,4],[107,2,107,3],[104,2,104,3],[106,2,106,3],[105,2,105,3],[113,1,113,33],[110,2,110,3],[108,2,108,3],[92,2,92,3],[97,2,97,3],[96,2,96,3],[86,2,86,3],[89,2,89,4],[88,2,88,3],[90,2,90,3],[93,2,93,3],[91,2,91,3],[87,2,87,3],[1,2,1,4],[7,2,10,2],[30,2,30,4],[28,2,28,3],[12,2,12,4],[4,2,4,3],[6,2,6,3],[14,2,14,3],[2,2,2,4],[18,2,18,4],[13,2,13,3],[25,2,25,4],[5,2,5,3]]}
[null,null,null,null,null,null,null,null,null,null,null,null,null,null,null,null,null,null,null,null,null,"2015-03-01"]
[null,null,"Income Tax 2015-16\ndesigned by Ch Nagendra Rao,SA(Maths), Cell : 9440297273",null,null,null,null,1,null,null,null,null,null,null,null,null,null,null,null,null,null,"2015-04-01"]
[null,null,"1.We have to fill up the items in the Green colour boxes using  \"TAB\" button\n2.Fillup Employee ID NO, then click \"Submit\" button compulsory.Dates should be in the form of MM-DD-YYYY\n3.Read the fields carefully and click on \"Yes\" or \"No\" buttons which is applicable to you.\n4.At the end of this sheet please click \"Submit\" button compulsory\n5.In \"house rent receipt\" sheet;  Door No, place, Address should be noted manually.",null,null,null,null,2]
[null,1,"Employee ID NO (ID given by the Treasury ) :","0926013",null,null,null,3,"2015-03-01",{"$f":"IF(AND(I4>=SalaryParticulars!$AO$4,I4<SalaryParticulars!$AI$2),Data!$F$39,LOOKUP(I4,SalaryParticulars!$AI$1:$AI$5,SalaryParticulars!$AJ$1:$AJ$5))","v":16600},{"$f":"IF(I4=$V$1,77.896,IF(I4>=$G$22,$I$22,IF(I4>=$G$21,$I$21,IF(I4>=$F$21,$I$19,0))))","v":77.896000000000001},{"$f":"E24","v":12},{"$f":"IF(I4>=$F$22,$I$22,IF(I4>=$F$21,$I$21,$I$19))","v":8.9079999999999995}]
[null,null,"Name of the Teacher/Employee",null,"G.Venugopal",null,null,4,"2015-04-01",{"$f":"IF(AND(I5>=SalaryParticulars!$AO$4,I5<SalaryParticulars!$AI$2),Data!$F$39,LOOKUP(I5,SalaryParticulars!$AI$1:$AI$5,SalaryParticulars!$AJ$1:$AJ$5))","v":35120},{"$f":"IF(I5=$V$1,77.896,IF(I5>=$G$22,$I$22,IF(I5>=$G$21,$I$21,IF(I5>=$F$21,$I$19,0))))","v":8.9079999999999995},{"$f":"IF(I5>=$F$25,E25,L4)","v":14.5},8.9079999999999995,{"$f":"ROUND(J5*M5%,0)-ROUND(J5*K5%,0)","v":0},{"$f":"IF(I5>$K$22,(ROUND(J5*$I$22%,0)-ROUND(J5*$I$22%,0)),IF(I5>=$F$22,(ROUND(J5*$I$22%,0)-ROUND(J5*$I$21%,0)),IF(I5>$K$21,(ROUND(J5*$I$21%,0)-ROUND(J5*$I$21%,0)),(ROUND(J5*$I$21%,0)-ROUND(J5*$I$19%,0)))))","v":0},{"$f":"$I$21","v":8.9079999999999995},{"$f":"IF(I5>$E$21,$I$21,$I$19)","v":8.9079999999999995},{"$f":"ROUND(J5*P5%,0)-ROUND(J5*Q5%,0)","v":0},{"$f":"IF(I5>=$D$22,$I$22,0)","v":0},{"$f":"IF(I5>$E$22,$I$22,IF(I5>=$D$22,P5,0))","v":0},{"$f":"ROUND(J5*S5%,0)-ROUND(J5*T5%,0)","v":0}]
[null,null,"Design",null,"SGT",null,null,5,"2015-05-01",{"$f":"IF(AND(I6>=SalaryParticulars!$AO$4,I6<SalaryParticulars!$AI$2),Data!$F$39,LOOKUP(I6,SalaryParticulars!$AI$1:$AI$5,SalaryParticulars!$AJ$1:$AJ$5))","v":35120},8.9079999999999995,{"$f":"IF(I6>=$F$25,E26,L5)","v":0},8.9079999999999995,0,0,8.9079999999999995,8.9079999999999995,0,0,0,0]
[null,null,"Sex    (Male=M, Female=F)",null,"M",null,null,6,"2015-06-01",{"$f":"IF(AND(I7>=SalaryParticulars!$AO$4,I7<SalaryParticulars!$AI$2),Data!$F$39,LOOKUP(I7,SalaryParticulars!$AI$1:$AI$5,SalaryParticulars!$AJ$1:$AJ$5))","v":35120},8.9079999999999995,"Not Applicable",8.9079999999999995,0,0,8.9079999999999995,8.9079999999999995,0,0,0,0,null,null,null,null,null,null,"Medical Insurance premium U/S. 80-D ",null,"LIC Premium (Salary Deduction) per month"]
[null,null,"Official Address","School Name","MPP School",null,null,7,"2015-07-01",{"$f":"IF(AND(I8>=SalaryParticulars!$AO$4,I8<SalaryParticulars!$AI$2),Data!$F$39,LOOKUP(I8,SalaryParticulars!$AI$1:$AI$5,SalaryParticulars!$AJ$1:$AJ$5))","v":35120},8.9079999999999995,"above 40%",8.9079999999999995,0,0,8.9079999999999995,8.9079999999999995,0,8.9079999999999995,8.9079999999999995,0,null,null,null,null,null,null,"Treatment of Handicapped Dependent U/S.80-DD ",null,"LIC (Others) per year"]
{"$rows_left_out":281}
{"sheet":"SalaryParticulars","index":1,"n_rows":55,"n_cols":51,"rows_kept":55,"cut":false,"hidden":false,"merged":[[27,0,27,1],[4,0,4,1],[26,0,26,1],[20,0,20,1],[24,0,24,1],[25,0,25,1]]}
["Before You Print this sheet we should observe that whether all amounts and arrears are correct or not.\nAlso hide the unnecessary columns",null,null,null,null,null,null,null,null,null,null,null,null,null,null,null,null,null,null,null,null,null,null,null,null,null,null,null,null,{"$f":"Data!U39","v":"2015-03-01"},1,{"$f":"SMALL($AD$1:$AD$5,AE1)","v":"2015-03-01"},null,{"$f":"IF(AF1<Data!I2,Data!F19,AF1)","v":"2015-03-01"},{"$f":"SMALL($AH$1:$AH$5,AE1)","v":"2015-03-01"},{"$f":"LOOKUP(AI1,Data!$U$39:$U$43,Data!$E$39:$E$43)","v":16600},{"$f":"IF(AJ1=0,0,IF(AJ1>18630,350,IF(AJ1>13270,220,IF(AJ1>8200,160,120))))","v":220}]
[null,null,null,null,null,null,{"$f":"CONCATENATE(Data!E8,\", \",Data!E9,\", \",Data!E10,\" MANDAL, \",Data!E11,\" DISTRICT\")","v":"MPP School, NN Colony, Dhone, Mandal MANDAL, Kurnool Dist DISTRICT"},null,null,null,null,null,null,null,null,null,null,null,null,null,null,null,null,null,null,null,null,null,null,{"$f":"Data!U40","v":"2015-08-01"},2,{"$f":"SMALL($AD$1:$AD$5,AE2)","v":"2015-08-01"},null,{"$f":"IF(AF2<Data!$I$2,Data!$F$19,IF(AF2=AF1,Data!$F$19,AF2))","v":"2015-08-01"},{"$f":"SMALL($AH$1:$AH$5,AE2)","v":"2015-08-01"},{"$f":"LOOKUP(AI2,Data!U39:U43,Data!E39:E43)","v":36070},{"$f":"IF(AJ2=0,0,IF(AJ2>18630,350,IF(AJ2>13270,220,IF(AJ2>8200,160,120))))","v":350}]
[null,"DETAILS OF INCOME DURING THE FINANCIAL YEAR 2015-16 (Salaries of Mar-2015 to Feb-2016 (I.e.,  from  1.4.2015  to  31.3.2016))",null,null,null,null,null,null,null,null,null,null,null,null,null,null,null,null,null,null,null,null,null,null,null,null,null,null,null,{"$f":"Data!U41","v":"2016-04-01"},3,{"$f":"SMALL($AD$1:$AD$5,AE3)","v":"2016-04-01"},null,{"$f":"IF(AF3<Data!$I$2,Data!$F$19,IF(AF3=AF2,Data!$F$19,AF3))","v":"2016-04-01"},{"$f":"SMALL($AH$1:$AH$5,AE3)","v":"2016-03-01"},{"$f":"LOOKUP(AI3,Data!U39:U43,Data!E39:E43)","v":36070},{"$f":"IF(AJ3=0,0,IF(AJ3>18630,350,IF(AJ3>13270,220,IF(AJ3>8200,160,120))))","v":350}]
[null,null,null,"Name :",null,null,{"$f":"Data!E5","v":"G.Venugopal"},null,null,null,null,null,null,null,null,null,null,"Designation:",null,{"$f":"Data!E6","v":"SGT"},null,null,null,null,null,null,null,null,null,{"$f":"Data!U42","v":"2016-04-01"},4,{"$f":"SMALL($AD$1:$AD$5,AE4)","v":"2016-04-01"},null,{"$f":"IF(AF4<Data!$I$2,Data!$F$19,IF(AF4=AF3,Data!$F$19,AF4))","v":"2016-03-01"},{"$f":"SMALL($AH$1:$AH$5,AE4)","v":"2016-03-01"},{"$f":"LOOKUP(AI4,Data!U39:U43,Data!E39:E43)","v":36070},{"$f":"IF(AJ4=0,0,IF(AJ4>18630,350,IF(AJ4>13270,220,IF(AJ4>8200,160,120))))","v":350},null,null,"2016-03-01","2015-04-01",77.896000000000001]
["Period",null,"No of days","Pay ","PP+FP","HMA","D.A.","H.R.A.","CCA","CA","IR","TOTAL","P.F","P.T","G.I.S","L.I.C","CPS","APGLI","EHS CONTRIBUTION","E.W.F/\nAFFDF","CMRF","Income Tax","TOTAL \nDEDUCTIONS",null,"CA",null,"2015-12-01",null,null,{"$f":"Data!U43","v":"2016-04-01"},5,{"$f":"SMALL($AD$1:$AD$5,AE5)","v":"2016-04-01"},null,{"$f":"IF(AF5<Data!$I$2,Data!$F$19,IF(AF5=AF4,Data!$F$19,AF5))","v":"2016-03-01"},{"$f":"SMALL($AH$1:$AH$5,AE5)","v":"2016-04-01"},{"$f":"LOOKUP(AI5,Data!U39:U43,Data!E39:E43)","v":0},{"$f":"IF(AJ5=0,0,IF(AJ5>18630,350,IF(AJ5>13270,220,IF(AJ5>8200,160,120))))","v":0},null,null,"Pay","PP+FP","DA","HRA",null,"DA","HRA","CCA","Gr Hyd","Gr VSP","Vja","Others"]
[{"$f":"SalaryParticulars!AH6","v":"2015-03-01"},{"$f":"SalaryParticulars!AI6","v":"2015-03-31"},{"$f":"SalaryParticulars!AK6","v":31},{"$f":"ROUND(AN6*AK6/AJ6,0)","v":16600},{"$f":"ROUND(SalaryParticulars!AO6*SalaryParticulars!AK6/SalaryParticulars!AJ6,0)","v":0},{"$f":"Data!E17","v":0},{"$f":"ROUND(D6*AP4%,0)","v":12931},{"$f":"ROUND(D6*SalaryParticulars!AR6%,0)","v":1992},{"$f":"ROUND(SalaryParticulars!AU6*SalaryParticulars!AK6/SalaryParticulars!AJ6,0)","v":0},{"$f":"IF(Data!$D$28=\"Yes\",ROUND(IF(A6>=$AA$5,1350,900)*SalaryParticulars!AK6/SalaryParticulars!AJ6,0),0)","v":0},{"$f":"IF(A6<Data!V2,ROUND(SalaryParticulars!D6*27%,0),ROUND(D6*0%,0))","v":4482},{"$f":"SUM(D6:K6)","v":36005},{"$f":"IF(C6>=X6/2,IF(Data!$C$70=\"CPS\",0,IF(Data!$E$81>0,IF(A6>=Data!$D$81,Data!$E$81,Data!$E$70),Data!$E$70)),0)","v":1500},{"$f":"IF(Data!$D$28=\"Yes\",0,IF(C6>=X6/2,IF(L6>20000,200,IF(L6>15000,150,IF(L6>10000,100,IF(L6>5000,80,0)))),0))","v":200},{"$f":"IF(C6>=X6/2,IF(Data!$E$80>0,IF(A6>=Data!$D$80,Data!$E$80,Data!$E$69),Data!$E$69),0)","v":60},null,{"$f":"IF(Data!$C$70=\"CPS\",ROUND((SalaryParticulars!D6+SalaryParticulars!G6)*10%,0),0)","v":0},{"$f":"IF(C6>=X6/2,IF(Data!$E$79>0,IF(SalaryParticulars!A6>=Data!$D$79,Data!$E$79,Data!$E$68),Data!$E$68),0)","v":450},{"$f":"IF(C6>=X6/2,IF(A6>=$AA$6,Data!$E$66,0),0)","v":90},{"$f":"IF(C6>=X6/2,IF(OR(MONTH(A6)=3,MONTH(A6)=12),20,0),0)","v":20},0,{"$f":"IF(C6>=X6/2,LOOKUP(A6,Data!$C$92:$D$103,Data!$E$92:$E$103),0)","v":0},{"$f":"SUM(M6:V6)","v":2320},{"$f":"SalaryParticulars!AJ6","v":31},{"$f":"IF(J6>800,800,J6)","v":0},null,"2014-11-01",null,null,"2015-03-01",{"$f":"SMALL($AD$6:$AD$27,AC14)","v":"00:00:00"},{"$f":"IF(AE6<Data!$I$2,Data!$F$19,IF(AE6<$AD$6,Data!$F$19,AE6))","v":"2016-03-01"},{"$f":"SMALL($AF$6:$AF$27,AC14)","v":"2015-03-01"},{"$f":"AG6","v":"2015-03-01"},{"$f":"AH7-1","v":"2015-03-31"},{"$f":"DAY(DATE(YEAR(AH6),MONTH(AH6)+1,1)-1)","v":31},{"$f":"AI6-AH6+1","v":31},{"$f":"IF(AND(AH6>=$AO$4,AH6<$AI$2),Data!$F$39,LOOKUP(AH6,$AI$1:$AI$5,$AJ$1:$AJ$5))","v":16600},{"$f":"IF(AH6=Data!$G$33,Data!$H$33,IF(AH6=Data!$G$34,Data!$H$34,IF(AH6=Data!$G$35,Data!$H$35,Data!$H$36)))","v":1},{"$f":"IF(AH6>=$AN$4,0,ROUND(AL6*AM6,0))","v":16600},{"$f":"IF(AN6>0,ROUND(Data!$E$15*AK6*AM6/AK6,0),0)","v":0},{"$f":"IF(AH6>=Data!$G$22,Data!$I$22,IF(AH6>=Data!$G$21,Data!$I$21,IF(AH6>=Data!$F$21,Data!$I$19,0)))","v":8.9079999999999995},{"$f":"IF(Data!$D$25<Data!$D$24,Data!$E$24,IF(AI6>=Data!$D$25,Data!$E$25,Data!$E$24))","v":12},{"$f":"IF(AM6=0.5,AQ6*2,AQ6)","v":12},{"$f":"ROUND(AN6*AP6%*AK6/AJ6,0)","v":1479},{"$f":"ROUND(AN6*AQ6%*AK6/AJ6,0)","v":1992},{"$f":"IF(Data!$E$27=\"Greater Hyderabad\",SalaryParticulars!AV6,IF(Data!$E$27=\"Greater Visakhapatnam\",SalaryParticulars!AW6,IF(Data!$E$27=\"Vijayawada\",SalaryParticulars!AX6,IF(Data!$E$27=\"Other Muncipal Corporations\",SalaryParticulars!AY6,0))))","v":0},{"$f":"IF(AN6=0,0,IF(AN6>18030,525,IF(AN6>13270,350,IF(AN6>8200,300,200))))","v":350},{"$f":"IF(AN6=0,0,IF(AN6>18030,350,IF(AN6>13270,220,IF(AN6>8200,160,120))))","v":220},{"$f":"IF(AN6=0,0,IF(AN6>18030,350,IF(AN6>13270,220,IF(AN6>8200,160,120))))","v":220},{"$f":"IF(AN6=0,0,IF(AN6>18030,140,IF(AN6>13270,130,IF(AN6>8200,120,100))))","v":130}]
[{"$f":"SalaryParticulars!AH7","v":"2015-04-01"},{"$f":"SalaryParticulars!AI7","v":"2015-04-30"},{"$f":"SalaryParticulars!AK7","v":30},35120,{"$f":"ROUND(SalaryParticulars!AO7*SalaryParticulars!AK7/SalaryParticulars!AJ7,0)","v":0},{"$f":"IF(D7>0,IF(A7>=Data!$D$18,Data!$E$18,Data!$E$17),0)","v":0},{"$f":"ROUND(D7*SalaryParticulars!AP7%,0)","v":3128},{"$f":"ROUND(D7*SalaryParticulars!AR7%,0)","v":5092},{"$f":"ROUND(SalaryParticulars!AU7*SalaryParticulars!AK7/SalaryParticulars!AJ7,0)","v":0},{"$f":"IF(Data!$D$28=\"Yes\",ROUND(IF(A7>=$AA$5,1350,900)*SalaryParticulars!AK7/SalaryParticulars!AJ7,0),0)","v":0},{"$f":"ROUND(D7*0%,0)","v":0},43340,{"$f":"IF(C7>=X7/2,IF(Data!$C$70=\"CPS\",0,IF(Data!$E$81>0,IF(A7>=Data!$D$81,Data!$E$81,Data!$E$70),Data!$E$70)),0)","v":1500},{"$f":"IF(Data!$D$28=\"Yes\",0,IF(C7>=X7/2,IF(L7>20000,200,IF(L7>15000,150,IF(L7>10000,100,IF(L7>5000,80,0)))),0))","v":200},{"$f":"IF(C7>=X7/2,IF(Data!$E$80>0,IF(A7>=Data!$D$80,Data!$E$80,Data!$E$69),Data!$E$69),0)","v":60},null,{"$f":"IF(Data!$C$70=\"CPS\",ROUND((SalaryParticulars!D7+SalaryParticulars!G7)*10%,0),0)","v":0},{"$f":"IF(C7>=X7/2,IF(Data!$E$79>0,IF(SalaryParticulars!A7>=Data!$D$79,Data!$E$79,Data!$E$68),Data!$E$68),0)","v":450},{"$f":"IF(C7>=X7/2,IF(A7>=$AA$6,Data!$E$66,0),0)","v":90},0,0,{"$f":"IF(C7>=X7/2,LOOKUP(A7,Data!$C$92:$D$103,Data!$E$92:$E$103),0)","v":0},{"$f":"SUM(M7:V7)","v":2300},{"$f":"SalaryParticulars!AJ7","v":30},{"$f":"IF(J7>800,800,J7)","v":0},null,null,null,null,"2015-04-01",{"$f":"SMALL($AD$6:$AD$27,AC15)","v":"1900-01-01"},{"$f":"IF(IF(AE7<Data!$I$2,Data!$F$19,IF(AE7<$AD$6,Data!$F$19,AE7))=AF6,Data!$F$19,IF(AE7<Data!$I$2,Data!$F$19,IF(AE7<$AD$6,Data!$F$19,AE7)))","v":"2016-03-01"},{"$f":"SMALL($AF$6:$AF$27,AC15)","v":"2015-04-01"},{"$f":"IF(AG7=AH6,AG8,AG7)","v":"2015-04-01"},"2015-04-30",30,30,{"$f":"IF(AND(AH7>=$AO$4,AH7<$AI$2),Data!$F$39,LOOKUP(AH7,$AI$1:$AI$5,$AJ$1:$AJ$5))","v":35120},{"$f":"IF(AH7=Data!$G$33,Data!$H$33,IF(AH7=Data!$G$34,Data!$H$34,IF(AH7=Data!$G$35,Data!$H$35,Data!$H$36)))","v":1},{"$f":"IF(AH7>=$AN$4,0,ROUND(AL7*AM7,0))","v":35120},{"$f":"IF(AN7>0,ROUND(Data!$E$15*AK7*AM7/AK7,0),0)","v":0},{"$f":"IF(AH7>=Data!$G$22,Data!$I$22,IF(AH7>=Data!$G$21,Data!$I$21,IF(AH7>=Data!$F$21,Data!$I$19,0)))","v":8.9079999999999995},{"$f":"IF(Data!$D$25<Data!$D$24,Data!$E$24,IF(AI7>=Data!$D$25,Data!$E$25,Data!$E$24))","v":14.5},{"$f":"IF(AM7=0.5,AQ7*2,AQ7)","v":14.5},3128,5092,{"$f":"IF(Data!$E$27=\"Greater Hyderabad\",SalaryParticulars!AV7,IF(Data!$E$27=\"Greater Visakhapatnam\",SalaryParticulars!AW7,IF(Data!$E$27=\"Vijayawada\",SalaryParticulars!AX7,IF(Data!$E$27=\"Other Muncipal Corporations\",SalaryParticulars!AY7,0))))","v":0},{"$f":"IF(AN7=0,0,IF(AN7>18030,525,IF(AN7>13270,350,IF(AN7>8200,300,200))))","v":525},{"$f":"IF(AN7=0,0,IF(AN7>18030,350,IF(AN7>13270,220,IF(AN7>8200,160,120))))","v":350},{"$f":"IF(AN7=0,0,IF(AN7>18030,350,IF(AN7>13270,220,IF(AN7>8200,160,120))))","v":350},{"$f":"IF(AN7=0,0,IF(AN7>18030,140,IF(AN7>13270,130,IF(AN7>8200,120,100))))","v":140}]
[{"$f":"SalaryParticulars!AH8","v":"2015-05-01"},{"$f":"SalaryParticulars!AI8","v":"2015-05-31"},{"$f":"SalaryParticulars!AK8","v":31},35120,{"$f":"ROUND(SalaryParticulars!AO8*SalaryParticulars!AK8/SalaryParticulars!AJ8,0)","v":0},{"$f":"IF(D8>0,IF(A8>=Data!$D$18,Data!$E$18,Data!$E$17),0)","v":0},{"$f":"ROUND(D8*SalaryParticulars!AP8%,0)","v":3128},{"$f":"ROUND(D8*SalaryParticulars!AR8%,0)","v":5092},{"$f":"ROUND(SalaryParticulars!AU8*SalaryParticulars!AK8/SalaryParticulars!AJ8,0)","v":0},{"$f":"IF(Data!$D$28=\"Yes\",ROUND(IF(A8>=$AA$5,1350,900)*SalaryParticulars!AK8/SalaryParticulars!AJ8,0),0)","v":0},0,43340,{"$f":"IF(C8>=X8/2,IF(Data!$C$70=\"CPS\",0,IF(Data!$E$81>0,IF(A8>=Data!$D$81,Data!$E$81,Data!$E$70),Data!$E$70)),0)","v":1500},{"$f":"IF(Data!$D$28=\"Yes\",0,IF(C8>=X8/2,IF(L8>20000,200,IF(L8>15000,150,IF(L8>10000,100,IF(L8>5000,80,0)))),0))","v":200},{"$f":"IF(C8>=X8/2,IF(Data!$E$80>0,IF(A8>=Data!$D$80,Data!$E$80,Data!$E$69),Data!$E$69),0)","v":60},null,{"$f":"IF(Data!$C$70=\"CPS\",ROUND((SalaryParticulars!D8+SalaryParticulars!G8)*10%,0),0)","v":0},{"$f":"IF(C8>=X8/2,IF(Data!$E$79>0,IF(SalaryParticulars!A8>=Data!$D$79,Data!$E$79,Data!$E$68),Data!$E$68),0)","v":450},{"$f":"IF(C8>=X8/2,IF(A8>=$AA$6,Data!$E$66,0),0)","v":90},0,0,{"$f":"IF(C8>=X8/2,LOOKUP(A8,Data!$C$92:$D$103,Data!$E$92:$E$103),0)","v":0},2300,{"$f":"SalaryParticulars!AJ8","v":31},0,{"$f":"MONTH(A8)","v":5},{"$f":"YEAR(A8)","v":2015},null,null,"2015-05-01","1900-01-01",{"$f":"IF(IF(AE8<Data!$I$2,Data!$F$19,IF(AE8<$AD$6,Data!$F$19,AE8))=AF7,Data!$F$19,IF(AE8<Data!$I$2,Data!$F$19,IF(AE8<$AD$6,Data!$F$19,AE8)))","v":"2016-03-01"},"2015-05-01",{"$f":"IF(AG8=AH7,AG9,AG8)","v":"2015-05-01"},"2015-05-31",31,31,{"$f":"IF(AND(AH8>=$AO$4,AH8<$AI$2),Data!$F$39,LOOKUP(AH8,$AI$1:$AI$5,$AJ$1:$AJ$5))","v":35120},{"$f":"IF(AH8=Data!$G$33,Data!$H$33,IF(AH8=Data!$G$34,Data!$H$34,IF(AH8=Data!$G$35,Data!$H$35,Data!$H$36)))","v":1},35120,{"$f":"IF(AN8>0,ROUND(Data!$E$15*AK8*AM8/AK8,0),0)","v":0},{"$f":"IF(AH8>=Data!$G$22,Data!$I$22,IF(AH8>=Data!$G$21,Data!$I$21,IF(AH8>=Data!$F$21,Data!$I$19,0)))","v":8.9079999999999995},{"$f":"IF(Data!$D$25<Data!$D$24,Data!$E$24,IF(AI8>=Data!$D$25,Data!$E$25,Data!$E$24))","v":14.5},14.5,3128,5092,{"$f":"IF(Data!$E$27=\"Greater Hyderabad\",SalaryParticulars!AV8,IF(Data!$E$27=\"Greater Visakhapatnam\",SalaryParticulars!AW8,IF(Data!$E$27=\"Vijayawada\",SalaryParticulars!AX8,IF(Data!$E$27=\"Other Muncipal Corporations\",SalaryParticulars!AY8,0))))","v":0},525,350,350,140]
{"$rows_left_out":48}
{"sheet":"Ascessment form","index":2,"n_rows":64,"n_cols":14,"rows_kept":64,"cut":false,"hidden":false,"merged":[[63,6,63,9],[57,0,57,3],[57,6,57,8],[59,1,59,5],[52,6,52,8],[53,6,53,8],[54,6,54,8],[55,6,55,8],[56,6,56,8],[55,0,55,3],[3,3,3,6],[40,1,40,3],[51,0,51,4],[51,6,51,9],[1,1,1,2],[2,8,2,9],[5,8,5,9],[6,6,6,9],[4,8,4,9],[4,3,4,6],[3,1,5,2],[3,8,3,9],[5,3,5,6],[41,1,41,3],[10,2,10,6],[11,2,11,6],[0,0,0,9],[1,8,1,9],[2,1,2,2],[1,3,1,6],[2,3,2,6]]}
["INCOME TAX 2015-2016"]
["1.","Name :",null,{"$f":"Data!E5","v":"G.Venugopal"},null,null,null,"ID No :",{"$f":"Data!D4","v":"0926013"}]
[null,"Designation :",null,{"$f":"Data!E6","v":"SGT"},null,null,null,"Sex :",{"$f":"IF(Data!E7=\"M\",\"Male\",\"Female\")","v":"Male"},null,null,null,null,"."]
[null,"Address :",null,{"$f":"Data!E8&\", \"&Data!E9","v":"MPP School, NN Colony, Dhone"},null,null,null,"PAN No :",{"$f":"Data!E12","v":"AJVPG9142R"}]
[null,null,null,{"$f":"Data!E10&\" MANDAL\"","v":"Mandal MANDAL"}]
[null,null,null,{"$f":"Data!E11&\" DISTRICT\"","v":"Kurnool Dist DISTRICT"}]
["2.","Whether living in own house / rented house :",null,null,null,null,{"$f":"IF(Data!E46>0,\"Rented House\",\"Own House\")","v":"Rented House"}]
["3.","Pay and allowances as per statement",null,null,null,null,null,null,null,{"$f":"SalaryParticulars!L28","v":543213}]
{"$rows_left_out":57}
{"sheet":"house rent reciept","index":3,"n_rows":138,"n_cols":23,"rows_kept":138,"cut":false,"hidden":false,"merged":[[0,0,0,6],[23,1,23,2],[4,4,4,6],[6,1,6,3],[8,3,8,6],[19,0,19,1],[5,0,5,6],[6,4,6,5],[7,5,7,6],[22,0,22,2],[1,0,1,6],[2,0,2,6],[20,0,20,2],[18,1,18,3],[21,0,21,2]]}
["Drawing house rent allowance upto Rs.3000/- per month need not produce of rent receipt.\nIf annual rent paid exceeds Rs 1,00,000 per annum, it is mandatory for the employee to report PAN of the House Owner "]
["RECEIPT OF HOUSE RENT"]
["(Under Section 1 (13-A) of Income Tax Act )"]
[]
["Received a sum of Rs. ",null,{"$f":"Data!E46*12","v":90000}," (Rupees"]
[{"$f":"H124","v":"Ninety thousand only"}]
["from",{"$f":"Data!E5","v":"G.Venugopal"},null,null,"towards the rent @ Rs.",null,{"$f":"Data!E46","v":7500}]
["per month  from",null,"2015-03-01","to","2016-02-01","in respect of"]
{"$rows_left_out":131}
{"sheet":"Form 16(page1)","index":4,"n_rows":50,"n_cols":13,"rows_kept":50,"cut":false,"hidden":false,"merged":[[15,0,15,12],[22,0,22,4],[24,0,24,2],[34,13,34,14],[35,3,36,5],[35,7,36,9],[35,10,36,12],[35,0,36,2],[13,0,13,1],[13,2,13,5],[13,6,13,8],[13,9,13,11],[14,0,14,1],[14,2,14,5],[14,6,14,8],[14,9,14,11],[11,0,11,1],[11,2,11,5],[11,6,11,8],[11,9,11,11],[12,0,12,1],[12,2,12,5],[12,6,12,8],[12,9,12,11],[8,0,8,12],[9,0,9,1],[9,2,9,5],[9,6,9,11],[10,0,10,1],[10,2,10,5],[10,6,10,8],[10,9,10,11],[46,0,46,2],[47,0,47,2],[0,0,0,12],[1,0,1,12],[2,0,2,12],[3,0,3,12],[4,0,4,5],[4,6,4,12],[5,0,5,5],[5,6,5,12],[6,0,6,2],[6,3,6,5],[6,6,6,12],[7,0,7,2],[7,3,7,5],[7,6,7,12]]}
["  FROM  NO. 16"]
["[See rule 31(1)(a)]"]
["Certificate under section 203 of the Income -tax Act,1961 for tax deducted at source   "]
["from income chargeable under the head \"salaries\""]
["Name and address of the Employer",null,null,null,null,null,"Name and designation of the Employee"]
[{"$f":"UPPER(Data!E105)&\",                                                    \"&UPPER(Data!E107)","v":"J.RAMACHANDRUDU,                                                    MEO, DHONE"},null,null,null,null,null,{"$f":"UPPER(Data!E5)&\", \"&Data!E6","v":"G.VENUGOPAL, SGT"}]
["PAN No. Of the deductor ",null,null,"TAN No. Of the deductor ",null,null,"PAN No. Of the Employee"]
[{"$f":"UPPER(Data!E109)","v":""},null,null,{"$f":"UPPER(Data!E110)","v":""},null,null,{"$f":"UPPER(Data!E12)","v":"AJVPG9142R"}]
{"$rows_left_out":43}
{"sheet":"Form 16(page2)","index":5,"n_rows":131,"n_cols":17,"rows_kept":131,"cut":false,"hidden":false,"merged":[[37,7,37,8],[37,9,37,10],[35,5,35,6],[35,7,35,8],[35,9,35,10],[36,5,36,6],[36,7,36,8],[36,9,36,10],[29,5,29,6],[29,7,29,8],[29,9,29,10],[25,9,26,10],[46,1,46,2],[40,0,42,10],[38,9,38,10],[39,5,39,6],[39,7,39,8],[39,9,39,10],[38,5,38,6],[38,7,38,8],[37,5,37,6],[34,5,34,6],[34,7,34,8],[34,9,34,10],[30,9,30,10],[31,5,31,6],[32,7,32,8],[32,9,32,10],[33,5,33,6],[31,7,31,8],[31,9,31,10],[32,5,32,6],[33,7,33,8],[1,0,1,4],[1,9,1,10],[2,0,2,1],[3,0,3,1],[3,2,3,4],[2,2,2,4],[1,7,1,8],[7,0,7,1],[9,0,9,5],[8,0,8,1],[8,2,8,4],[4,2,4,4],[5,0,5,1],[5,2,5,4],[6,0,6,1],[6,2,6,4],[4,0,4,1],[46,7,46,10],[47,7,47,10],[27,9,27,10],[27,7,27,8],[7,2,7,4],[28,9,28,10],[24,0,24,10],[23,0,23,10],[25,7,25,8],[25,5,26,6],[27,5,27,6],[28,5,28,6],[28,7,28,8],[33,9,33,10],[30,5,30,6],[30,7,30,8]]}
["(C) Other sections (e.g., 80E, 80G etc.) Under Chapter VIA"]
["Deduction",null,null,null,null,"Gross amount",null,"Qualifying amount",null,"Deductible Amount"]
["(a) Section",null,"80D Medical Insurance",null,null,"Rs.",{"$f":"'Ascessment form'!H34","v":1080},"Rs.",{"$f":"G3","v":1080},"Rs.",{"$f":"I3","v":1080}]
["(b) Section",null,"80DD Treatment of Handicapped \n          dependent",null,null,"Rs.",{"$f":"'Ascessment form'!H35","v":0},"Rs.",0,"Rs.",0]
["(c) Section",null,"80DDB Expenditure on medical\n           treatment",null,null,"Rs.",{"$f":"'Ascessment form'!H36","v":0},"Rs.",0,"Rs.",0]
["(d) Section",null,"80E Interest paid on Education Loan ",null,null,"Rs.",{"$f":"'Ascessment form'!H37","v":36800},"Rs.",36800,"Rs.",36800]
["(e) Section",null,"80G Donation to Charitable\n        Institution & CMRF",null,null,"Rs.",{"$f":"'Ascessment form'!H38","v":0},"Rs.",{"$f":"G7","v":0},"Rs.",0]
["(f) Section",null,"80U Maintenance of Totally Blind or PHC",null,null,"Rs.",{"$f":"'Ascessment form'!H39","v":0},"Rs.",0,"Rs.",0]
{"$rows_left_out":123}